Target
Sodium channel protein type 9 subunit alpha
Ligand
BDBM154367
Substrate
Meas. Tech.
In Vitro PX Assay
IC50
456±n/a nM
Citation
 Boezio, CBregman, HCoats, JRDimauro, EFDineen, TDu, BGraceffa, RKreiman, CLa, DMarx, IEChakka, NNguyen, HNPeterson, EAWeiss, MCopeland, KWDeak, HLBoezio, A Bicyclic aryl and heteroaryl sodium channel inhibitors US Patent  US9012443 Publication Date 4/21/2015 
Target
Name:
Sodium channel protein type 9 subunit alpha
Synonyms:
NENA Peripheral sodium channel 1 SCN9A_HUMAN Voltage-gated sodium channel subunit Nav1.7 hNE-Na
Type:
Protein
Mol. Mass.:
226375.97
Organism:
Homo sapiens (Human)
Description:
Q15858
Residue:
1988
  
Inhibitor
Name:
BDBM154367
Synonyms:
US9012443, 406
Type:
Small organic molecule
Emp. Form.:
C19H15N3O3S2
Mol. Mass.:
397.471
SMILES:
COc1ccccc1-c1nccc2cc(ccc12)S(=O)(=O)Nc1nccs1
: