Target
Phospholipase
Ligand
BDBM154519
Substrate
Meas. Tech.
Exogenous PldA Assay
pH
7.5±n/a
IC50
9900±400 nM
Comments
extracted
Citation
 Scott, SASpencer, CTO'Reilly, MCBrown, KALavieri, RRCho, CHJung, DILarock, RCBrown, HALindsley, CW Discovery of desketoraloxifene analogues as inhibitors of mammalian, Pseudomonas aeruginosa, and NAPE phospholipase D enzymes. ACS Chem Biol 10:421-32 (2015)  
Target
Name:
Phospholipase
Synonyms:
Phospholipase D (PldA)
Type:
Protein
Mol. Mass.:
122309.70
Organism:
Pseudomonas aeruginosa (g-Proteobacteria)
Description:
A0A0C6EPQ5
Residue:
1099
  
Inhibitor
Name:
BDBM154519
Synonyms:
Desketoraloxifene (10)
Type:
Small organic molecule
Emp. Form.:
C27H27NO3S
Mol. Mass.:
445.573
SMILES:
Oc1ccc(cc1)-c1sc2cc(O)ccc2c1-c1ccc(OCCN2CCCCC2)cc1
: