Target
Phospholipase
Ligand
BDBM154526
Substrate
Meas. Tech.
Exogenous PldA Assay
pH
7.5±n/a
IC50
1.78e+4± 1.0e+3 nM
Comments
extracted
Citation
 Scott, SASpencer, CTO'Reilly, MCBrown, KALavieri, RRCho, CHJung, DILarock, RCBrown, HALindsley, CW Discovery of desketoraloxifene analogues as inhibitors of mammalian, Pseudomonas aeruginosa, and NAPE phospholipase D enzymes. ACS Chem Biol 10:421-32 (2015)  
Target
Name:
Phospholipase
Synonyms:
Phospholipase D (PldA)
Type:
Protein
Mol. Mass.:
122309.70
Organism:
Pseudomonas aeruginosa (g-Proteobacteria)
Description:
A0A0C6EPQ5
Residue:
1099
  
Inhibitor
Name:
BDBM154526
Synonyms:
22B1 (17i)
Type:
Small organic molecule
Emp. Form.:
C20H14O2S
Mol. Mass.:
318.389
SMILES:
Oc1ccc(cc1)-c1c(sc2ccccc12)-c1cccc(O)c1
: