Target
AMP deaminase 1
Ligand
BDBM154583
Substrate
Meas. Tech.
AMPD Enzymatic Activity Assay
pH
7.4±n/a
IC50
24±n/a nM
Comments
extracted
Citation
 Admyre, TAmrot-Fors, LAndersson, MBauer, MBjursell, MDrmota, THallen, SHartleib-Geschwindner, JLindmark, BLiu, JLöfgren, LRohman, MSelmi, NWallenius, K Inhibition of AMP deaminase activity does not improve glucose control in rodent models of insulin resistance or diabetes. Chem Biol 21:1486-96 (2014)  
Target
Name:
AMP deaminase 1
Synonyms:
AMP deaminase 1 (mAMPD1) Ampd1
Type:
Protein
Mol. Mass.:
86110.42
Organism:
Mus musculus (Mouse)
Description:
Residue:
745
  
Inhibitor
Name:
BDBM154583
Synonyms:
6-[4-({[(1S)-1-(isoquinolin-8-yl)ethyl]amino}methyl)phenyl]pyridine-3-carboxylic acid (Compound 3)
Type:
Small organic molecule
Emp. Form.:
C24H21N3O2
Mol. Mass.:
383.4424
SMILES:
C[C@H](NCc1ccc(cc1)-c1ccc(cn1)C(O)=O)c1cccc2ccncc12
: