Target
Mitogen-activated protein kinase 1
Ligand
BDBM154887
Substrate
Meas. Tech.
IMAP Assay
IC50
16.9±n/a nM
Citation
 Deng, YZhu, LShipps, Jr., GWLo, SSun, BHuang, XBienstock, CCooper, ABGao, XYao, XZhu, HYKelly, JMBoga, SBAlhassan, ATagat, JRMansoor, UFWilson, KJO'Boyle, BMDaniels, MHSchell, ASiliphaivanh, PFischer, C Heterocyclic compounds as ERK inhibitors US Patent  US8999957 Publication Date 4/7/2015 
Target
Name:
Mitogen-activated protein kinase 1
Synonyms:
ERT1 Extracellular signal-regulated kinase 2 MAP kinase 1 MAP kinase ERK2 MAPK 2 Mapk Mitogen-activated protein kinase 2 p42 | p42-MAPK
Type:
Protein
Mol. Mass.:
41278.65
Organism:
Mus musculus (Mouse)
Description:
P63085
Residue:
358
  
Inhibitor
Name:
BDBM154887
Synonyms:
US8999957, Table 3, Compound 163
Type:
Small organic molecule
Emp. Form.:
C36H44FN7O5
Mol. Mass.:
673.7769
SMILES:
COc1cccc(F)c1CN1C[C@@H](CC[C@H]1C(=O)NCCCNC(=O)OC(C)(C)C)NC(=O)c1ccc2[nH]nc(-c3ccnc(C)c3)c2c1
: