Target
DNA-dependent protein kinase catalytic subunit
Ligand
BDBM155089
Substrate
Meas. Tech.
Biochemical Assay
pH
7.4±n/a
Temperature
298.15±n/a K
IC50
0.3±n/a nM
Comments
extracted
Citation
 Fuchss, TMederski, WZenke, F Imidazo[4,5-c]quinolines as DNA-PK inhibitors US Patent  US9000153 Publication Date 4/7/2015 
Target
Name:
DNA-dependent protein kinase catalytic subunit
Synonyms:
DNA-PK catalytic subunit DNA-dependent protein kinase (DNA-PK) DNA-dependent protein kinase catalytic subunit (DNA-PK) HYRC PRKDC | PRKDC_HUMAN
Type:
Protein
Mol. Mass.:
469114.78
Organism:
Homo sapiens (Human)
Description:
P78527
Residue:
4128
  
Inhibitor
Name:
BDBM155089
Synonyms:
US9000153, 42
Type:
Small organic molecule
Emp. Form.:
C25H19FN4O2S
Mol. Mass.:
458.507
SMILES:
COc1cc2ncc3n(C)c(=O)n(-c4ccc(cc4F)C#N)c3c2cc1CCc1ccsc1
: