Target
Beta-secretase 1
Ligand
BDBM155094
Substrate
Meas. Tech.
Diluted TR-FRET Assay
pH
2.5±n/a
IC50
6.7±n/a nM
Comments
extracted
Citation
 Karlstrom, SCsjernyik, GSwahn, BSandberg, LKolmodin, KSoderman, POhberg, L 2H-imidazol-4-amine compounds and their use as BACE inhibitors US Patent  US9000182 Publication Date 4/7/2015 
Target
Name:
Beta-secretase 1
Synonyms:
ASP2 Aspartyl protease 2 BACE1 Beta-secretase (BACE) Beta-secretase 1 (BACE 1) Beta-secretase 1 (BACE1) Beta-site amyloid precursor protein cleaving enzyme 1 Memapsin-2 beta-Secretase (BACE-1) | beta-Secretase (BACE1)
Type:
Protein
Mol. Mass.:
55755.10
Organism:
Homo sapiens (Human)
Description:
P56817
Residue:
501
  
Inhibitor
Name:
BDBM155094
Synonyms:
US9000182, 3
Type:
Small organic molecule
Emp. Form.:
C17H20BrN3O
Mol. Mass.:
362.264
SMILES:
CC1=NC2(N=C1N)c1cc(Br)ccc1C[C@@]21CC[C@H](O)CC1
: