Target
Beta-secretase 1
Ligand
BDBM155104
Substrate
Meas. Tech.
Diluted TR-FRET Assay
pH
2.5±n/a
IC50
3±n/a nM
Comments
extracted
Citation
 Karlstrom, SCsjernyik, GSwahn, BSandberg, LKolmodin, KSoderman, POhberg, L 2H-imidazol-4-amine compounds and their use as BACE inhibitors US Patent  US9000182 Publication Date 4/7/2015 
Target
Name:
Beta-secretase 1
Synonyms:
ASP2 Aspartyl protease 2 BACE1 Beta-secretase (BACE) Beta-secretase 1 (BACE 1) Beta-secretase 1 (BACE1) Beta-site amyloid precursor protein cleaving enzyme 1 Memapsin-2 beta-Secretase (BACE-1) | beta-Secretase (BACE1)
Type:
Protein
Mol. Mass.:
55755.10
Organism:
Homo sapiens (Human)
Description:
P56817
Residue:
501
  
Inhibitor
Name:
BDBM155104
Synonyms:
US9000182, 13, isomer 1
Type:
Small organic molecule
Emp. Form.:
C21H26F3N3O2
Mol. Mass.:
409.4452
SMILES:
CC1=N[C@]2(N=C1N)c1cc(OCCCF)ccc1C[C@@]21CC[C@@H](CC1)OC(F)F
: