Target
Beta-secretase 1
Ligand
BDBM155135
Substrate
Meas. Tech.
Diluted TR-FRET Assay
pH
2.5±n/a
IC50
14±n/a nM
Comments
extracted
Citation
 Karlstrom, SSandberg, LSoderman, PKolmodin, KOhberg, L Cyclohexane-1,2′-naphthalene-1′,2″-imidazol compounds and their use as BACE inhibitors US Patent  US9000184 Publication Date 4/7/2015 
Target
Name:
Beta-secretase 1
Synonyms:
ASP2 Aspartyl protease 2 BACE1 Beta-secretase (BACE) Beta-secretase 1 (BACE 1) Beta-secretase 1 (BACE1) Beta-site amyloid precursor protein cleaving enzyme 1 Memapsin-2 beta-Secretase (BACE-1) | beta-Secretase (BACE1)
Type:
Protein
Mol. Mass.:
55755.10
Organism:
Homo sapiens (Human)
Description:
P56817
Residue:
501
  
Inhibitor
Name:
BDBM155135
Synonyms:
US9000184, 7, isomer 1
Type:
Small organic molecule
Emp. Form.:
C24H27ClN4O
Mol. Mass.:
422.95
SMILES:
CO[C@H]1CC[C@]2(CC1)CCc1ccc(cc1C21N=C(C)C(N)=N1)-c1cncc(Cl)c1
: