Target
Tyrosine-protein kinase ZAP-70
Ligand
BDBM5073
Substrate
ZAP-70 SH2 Binding Substrate
Meas. Tech.
Competitive Binding Assay
IC50
5000±n/a nM
Citation
 Vu, CBCorpuz, EGMerry, TJPradeepan, SGBartlett, CBohacek, RSBotfield, MCEyermann, CJLynch, BAMacNeil, IARam, MKvan Schravendijk, MRViolette, SSawyer, TK Discovery of potent and selective SH2 inhibitors of the tyrosine kinase ZAP-70. J Med Chem 42:4088-98 (1999)  
Target
Name:
Tyrosine-protein kinase ZAP-70
Synonyms:
70 kDa zeta-associated protein Syk-related tyrosine kinase Tyrosine-protein kinase ZAP-70 Tyrosine-protein kinase ZAP-70 (ZAP70) ZAP70 Zeta-chain (TCR) associated protein kinase 70kDa
Type:
Enzyme
Mol. Mass.:
69881.61
Organism:
Homo sapiens (Human)
Description:
ZAP-70 SH2 domain was expressed and purified from E. coli using O-phospho-L-tyrosine-agarose column.
Residue:
619
  
Inhibitor
Name:
BDBM5073
Synonyms:
1,2,4-Oxadiazole Analogue 5l | 4-[(2S)-2-{[(1S)-1-{3-[(3-bromo-4-chlorophenyl)methyl]-1,2,4-oxadiazol-5-yl}ethyl]carbamoyl}-2-acetamidoethyl]phenoxyphosphonic acid
Type:
Small organic molecule
Emp. Form.:
C22H23BrClN4O7P
Mol. Mass.:
601.771
SMILES:
C[C@H](NC(=O)[C@H](Cc1ccc(OP(O)(O)=O)cc1)NC(C)=O)c1nc(Cc2ccc(Cl)c(Br)c2)no1
:
Substrate
Name:
ZAP-70 SH2 Binding Substrate
Synonyms:
Type:
Peptide
Mol. Mass.:
2801.56
Organism:
Description:
Residue:
23