Target
3-hydroxy-3-methylglutaryl-coenzyme A reductase
Ligand
BDBM50221993
Substrate
Meas. Tech.
Reductase Assay
pH
7.2±n/a
IC50
7±n/a nM
Comments
extracted
Citation
 Lindsay, DJackson, PHindley, SBhamra, I Rosuvastatin and atorvastatin derivatives US Patent  US9006282 Publication Date 4/14/2015 
Target
Name:
3-hydroxy-3-methylglutaryl-coenzyme A reductase
Synonyms:
HMDH_RAT Hmgcr
Type:
Enzyme
Mol. Mass.:
96689.85
Organism:
Rattus norvegicus (rat)
Description:
Isolated rat liver microsomes were used as enzyme source.
Residue:
887
  
Inhibitor
Name:
BDBM50221993
Synonyms:
CHEMBL393220 US9006282, Atorvastatin calcium bis{(3R,5R)-7-[3-(anilinocarbonyl)-5-(4-fluorophenyl)-2-isopropyl-4-phenyl-1H-pyrrol-1-yl]-3,5-dihydroxyheptanoate}
Type:
Small organic molecule
Emp. Form.:
C33H34FN2O5
Mol. Mass.:
557.6324
SMILES:
CC(C)c1c(C(=O)Nc2ccccc2)c(c(-c2ccc(F)cc2)n1CC[C@@H](O)C[C@@H](O)CC([O-])=O)-c1ccccc1
: