Target
ATP-sensitive inward rectifier potassium channel 1
Ligand
BDBM155927
Substrate
Meas. Tech.
Electrophysiology Assay
pH
7.4±n/a
IC50
15±n/a nM
Comments
extracted
Citation
 Pasternak, AZhu, YShahripour, ATang, HYang, LWalsh, SPTeumelsan, NH Inhibitors of the renal outer medullary potassium channel US Patent  US9018211 Publication Date 4/28/2015 
Target
Name:
ATP-sensitive inward rectifier potassium channel 1
Synonyms:
ATP-regulated potassium channel ROM-K Inward rectifier K(+) channel Kir1.1 KCNJ1_RAT Potassium channel (ATP modulatory) Renal Outer Medullary Potassium (ROMK) Romk1 | The Renal Outer Medullary Potassium (ROMK) channel (Kir1.1)
Type:
Enzyme
Mol. Mass.:
44976.27
Organism:
Rattus norvegicus (Rat)
Description:
P35560
Residue:
391
  
Inhibitor
Name:
BDBM155927
Synonyms:
US9018211, 22 (isomer 2)
Type:
Small organic molecule
Emp. Form.:
C24H26FN3O4
Mol. Mass.:
439.4793
SMILES:
COc1cc(C(O)CN2CCN(CCc3ccc4C(=O)OCc4c3)CC2)c(F)cc1C#N
: