Target
Lysosomal protective protein
Ligand
BDBM156718
Substrate
Meas. Tech.
Inhibition Assay
pH
5.5±n/a
Temperature
298.15±n/a K
IC50
3620±n/a nM
Comments
extracted
Citation
 Ruf, SSadowski, TWirth, KSchreuder, HBuning, C Substituted 3-heteroaroylamino-propionic acid derivatives and their use as pharmaceuticals US Patent  US9029559 Publication Date 5/12/2015 
Target
Name:
Lysosomal protective protein
Synonyms:
CTSA Cathepsin A (CTSA) PPGB | PPGB_HUMAN
Type:
Protein
Mol. Mass.:
54465.95
Organism:
Homo sapiens (Human)
Description:
P10619
Residue:
480
  
Inhibitor
Name:
BDBM156718
Synonyms:
US9029559, 134
Type:
Small organic molecule
Emp. Form.:
C22H18ClFN2O3
Mol. Mass.:
412.841
SMILES:
Cc1ccccc1[C@H](CC(O)=O)NC(=O)c1cccc(n1)-c1ccc(F)c(Cl)c1
: