Target
Lysosomal protective protein
Ligand
BDBM156793
Substrate
Meas. Tech.
Inhibition Assay
pH
5.5±n/a
Temperature
298.15±n/a K
IC50
37±n/a nM
Comments
extracted
Citation
 Ruf, SSadowski, TWirth, KSchreuder, HBuning, C Substituted 3-heteroaroylamino-propionic acid derivatives and their use as pharmaceuticals US Patent  US9029559 Publication Date 5/12/2015 
Target
Name:
Lysosomal protective protein
Synonyms:
CTSA Cathepsin A (CTSA) PPGB | PPGB_HUMAN
Type:
Protein
Mol. Mass.:
54465.95
Organism:
Homo sapiens (Human)
Description:
P10619
Residue:
480
  
Inhibitor
Name:
BDBM156793
Synonyms:
US9029559, 222
Type:
Small organic molecule
Emp. Form.:
C25H26N2O4
Mol. Mass.:
418.4849
SMILES:
COc1ccc(nc1-c1cccc(C)c1C)C(=O)N[C@@H](CC(O)=O)c1ccc(C)cc1
: