Target
Lysosomal protective protein
Ligand
BDBM156883
Substrate
Meas. Tech.
Inhibition Assay
pH
5.5±n/a
Temperature
298.15±n/a K
IC50
48.4±n/a nM
Comments
extracted
Citation
 Ruf, SSadowski, TWirth, KSchreuder, HBuning, C Substituted 3-heteroaroylamino-propionic acid derivatives and their use as pharmaceuticals US Patent  US9029559 Publication Date 5/12/2015 
Target
Name:
Lysosomal protective protein
Synonyms:
CTSA Cathepsin A (CTSA) PPGB | PPGB_HUMAN
Type:
Protein
Mol. Mass.:
54465.95
Organism:
Homo sapiens (Human)
Description:
P10619
Residue:
480
  
Inhibitor
Name:
BDBM156883
Synonyms:
US9029559, 320
Type:
Small organic molecule
Emp. Form.:
C22H17ClF2N2O4
Mol. Mass.:
446.831
SMILES:
COc1ccc(nc1-c1cccc(Cl)c1F)C(=O)N[C@@H](CC(O)=O)c1ccccc1F
: