Target
Lysosomal protective protein
Ligand
BDBM156891
Substrate
Meas. Tech.
Inhibition Assay
pH
5.5±n/a
Temperature
298.15±n/a K
IC50
3740±n/a nM
Comments
extracted
Citation
 Ruf, SSadowski, TWirth, KSchreuder, HBuning, C Substituted 3-heteroaroylamino-propionic acid derivatives and their use as pharmaceuticals US Patent  US9029559 Publication Date 5/12/2015 
Target
Name:
Lysosomal protective protein
Synonyms:
CTSA Cathepsin A (CTSA) PPGB | PPGB_HUMAN
Type:
Protein
Mol. Mass.:
54465.95
Organism:
Homo sapiens (Human)
Description:
P10619
Residue:
480
  
Inhibitor
Name:
BDBM156891
Synonyms:
US9029559, 329
Type:
Small organic molecule
Emp. Form.:
C23H18ClF3N2O4
Mol. Mass.:
478.848
SMILES:
COc1ccc(nc1-c1cccc(c1)C(F)(F)F)C(=O)N[C@@H](CC(O)=O)c1ccccc1Cl
: