Target
Lysosomal protective protein
Ligand
BDBM157062
Substrate
Meas. Tech.
Inhibition Assay
pH
5.5±n/a
Temperature
298.15±n/a K
IC50
87.1±n/a nM
Comments
extracted
Citation
 Ruf, SSadowski, TWirth, KSchreuder, HBuning, C Substituted 3-heteroaroylamino-propionic acid derivatives and their use as pharmaceuticals US Patent  US9029559 Publication Date 5/12/2015 
Target
Name:
Lysosomal protective protein
Synonyms:
CTSA Cathepsin A (CTSA) PPGB | PPGB_HUMAN
Type:
Protein
Mol. Mass.:
54465.95
Organism:
Homo sapiens (Human)
Description:
P10619
Residue:
480
  
Inhibitor
Name:
BDBM157062
Synonyms:
US9029559, 515
Type:
Small organic molecule
Emp. Form.:
C15H16ClN5O3
Mol. Mass.:
349.772
SMILES:
Cc1ccccc1[C@H](CC(O)=O)NC(=O)c1nc(Cl)c(N)nc1N
: