Target
Lysosomal protective protein
Ligand
BDBM157111
Substrate
Meas. Tech.
Inhibition Assay
pH
5.5±n/a
Temperature
298.15±n/a K
IC50
322±n/a nM
Comments
extracted
Citation
 Ruf, SSadowski, TWirth, KSchreuder, HBuning, C Substituted 3-heteroaroylamino-propionic acid derivatives and their use as pharmaceuticals US Patent  US9029559 Publication Date 5/12/2015 
Target
Name:
Lysosomal protective protein
Synonyms:
CTSA Cathepsin A (CTSA) PPGB | PPGB_HUMAN
Type:
Protein
Mol. Mass.:
54465.95
Organism:
Homo sapiens (Human)
Description:
P10619
Residue:
480
  
Inhibitor
Name:
BDBM157111
Synonyms:
US9029559, 591
Type:
Small organic molecule
Emp. Form.:
C21H16ClFN2O3
Mol. Mass.:
398.815
SMILES:
OC(=O)C[C@H](NC(=O)c1cccc(n1)-c1ccccc1F)c1ccc(Cl)cc1
: