Target
ALK tyrosine kinase receptor
Ligand
BDBM158154
Substrate
Meas. Tech.
Biochemical Assay
pH
7.5±n/a
IC50
55±n/a nM
Comments
extracted
Citation
 Lombardi Borgia, AMenichincheri, MOrsini, PPanzeri, APerrone, EVanotti, ENesi, MMarchionni, C Substituted indazole derivatives active as kinase inhibitors US Patent  US9029356 Publication Date 5/12/2015 
Target
Name:
ALK tyrosine kinase receptor
Synonyms:
ALK ALK_HUMAN CD_antigen: CD246
Type:
Protein
Mol. Mass.:
176453.10
Organism:
Homo sapiens (Human)
Description:
Q9UM73
Residue:
1620
  
Inhibitor
Name:
BDBM158154
Synonyms:
US10081622, Compound 11 US11059827, Compound Entrectinib US9029356, 11 US9616059, 11
Type:
Small organic molecule
Emp. Form.:
C31H34F2N6O2
Mol. Mass.:
560.6375
SMILES:
CN1CCN(CC1)c1ccc(C(=O)Nc2n[nH]c3ccc(Cc4cc(F)cc(F)c4)cc23)c(NC2CCOCC2)c1
: