Target
Insulin-like growth factor 1 receptor
Ligand
BDBM158156
Substrate
Meas. Tech.
Biochemical Assay
IC50
1103±n/a nM
Citation
 Lombardi Borgia, AMenichincheri, MOrsini, PPanzeri, APerrone, EVanotti, ENesi, MMarchionni, C Substituted indazole derivatives active as kinase inhibitors US Patent  US9029356 Publication Date 5/12/2015 
Target
Name:
Insulin-like growth factor 1 receptor
Synonyms:
CD_antigen=CD221 IGF1R Insulin-like growth factor 1 receptor (IGF1R) Insulin-like growth factor 1 receptor alpha chain Insulin-like growth factor I receptor | Insulin-like growth factor receptor (IGFR)
Type:
Protein
Mol. Mass.:
154776.79
Organism:
Homo sapiens (Human)
Description:
P08069
Residue:
1367
  
Inhibitor
Name:
BDBM158156
Synonyms:
US10081622, Compound 26 US9255087, 26 | US9616059, 26
Type:
Small organic molecule
Emp. Form.:
C29H32F2N6O2
Mol. Mass.:
534.6002
SMILES:
COCCNc1cc(ccc1C(=O)Nc1n[nH]c2ccc(Cc3cc(F)cc(F)c3)cc12)N1CCN(C)CC1
: