Target
Mitogen-activated protein kinase kinase kinase 14
Ligand
BDBM158675
Substrate
Meas. Tech.
Inhibition Assay
pH
7.2±n/a
Ki
0.3±n/a nM
Comments
extracted
Citation
 Staben, SCastanedo, GMontalbetti, CAFeng, J Tricyclic compounds and methods of use therefor US Patent  US9034866 Publication Date 5/19/2015 
Target
Name:
Mitogen-activated protein kinase kinase kinase 14
Synonyms:
HsNIK MAP3K14 NF-kappa-beta-inducing kinase (NF-kB) Serine/threonine-protein kinase NIK
Type:
Protein
Mol. Mass.:
104059.50
Organism:
Homo sapiens (Human)
Description:
Q99558
Residue:
947
  
Inhibitor
Name:
BDBM158675
Synonyms:
US9034866, 150
Type:
Small organic molecule
Emp. Form.:
C22H20N4O3
Mol. Mass.:
388.4192
SMILES:
Cc1cc(no1)[C@](C)(O)C#Cc1ccc2C3CC(C3)n3cc(nc3-c2c1)C(N)=O
: