Target
Mitogen-activated protein kinase kinase kinase 14
Ligand
BDBM158788
Substrate
Meas. Tech.
Inhibition Assay
pH
7.2±n/a
Ki
0.24±n/a nM
Comments
extracted
Citation
 Staben, SCastanedo, GMontalbetti, CAFeng, J Tricyclic compounds and methods of use therefor US Patent  US9034866 Publication Date 5/19/2015 
Target
Name:
Mitogen-activated protein kinase kinase kinase 14
Synonyms:
HsNIK MAP3K14 NF-kappa-beta-inducing kinase (NF-kB) Serine/threonine-protein kinase NIK
Type:
Protein
Mol. Mass.:
104059.50
Organism:
Homo sapiens (Human)
Description:
Q99558
Residue:
947
  
Inhibitor
Name:
BDBM158788
Synonyms:
US9034866, 263
Type:
Small organic molecule
Emp. Form.:
C19H17FN4O4
Mol. Mass.:
384.3611
SMILES:
CN1CC[C@@](O)(C#Cc2cc3-c4nc(cn4CCOc3cc2F)C(N)=O)C1=O
: