Target
Mitogen-activated protein kinase kinase kinase 14
Ligand
BDBM159170
Substrate
Meas. Tech.
Inhibition Assay
pH
7.2±n/a
Ki
0.4±n/a nM
Comments
extracted
Citation
 Staben, SCastanedo, GMontalbetti, CAFeng, J Tricyclic compounds and methods of use therefor US Patent  US9034866 Publication Date 5/19/2015 
Target
Name:
Mitogen-activated protein kinase kinase kinase 14
Synonyms:
HsNIK MAP3K14 NF-kappa-beta-inducing kinase (NF-kB) Serine/threonine-protein kinase NIK
Type:
Protein
Mol. Mass.:
104059.50
Organism:
Homo sapiens (Human)
Description:
Q99558
Residue:
947
  
Inhibitor
Name:
BDBM159170
Synonyms:
US9034866, 647
Type:
Small organic molecule
Emp. Form.:
C19H17N3O5S
Mol. Mass.:
399.42
SMILES:
CN1CC[C@@](O)(C#Cc2ccc3OC[C@H](O)c4sc(nc4-c3c2)C(N)=O)C1=O
: