Target
Sodium/glucose cotransporter 2
Ligand
BDBM159516
Substrate
Meas. Tech.
Inhibition Assay
pH
7.4±n/a
Temperature
310.15±n/a K
IC50
0.366±n/a nM
Comments
extracted
Citation
 Choi, SSong, KSLee, SHKim, MJSeo, HJPark, EKong, YPark, SOKang, HJung, MELee, KKim, HJLee, JSLee, MWKim, MHong, DHKang, M Diphenylmethane derivatives as SGLT2 inhibitors US Patent  US9034921 Publication Date 5/19/2015 
Target
Name:
Sodium/glucose cotransporter 2
Synonyms:
Na(+)/glucose cotransporter 2 SGLT2 Sodium-Dependent Glucose Cotransporter 2 (SGLT2) Solute carrier family 5 member 2
Type:
Protein
Mol. Mass.:
72902.00
Organism:
Homo sapiens (Human)
Description:
P31639
Residue:
672
  
Inhibitor
Name:
BDBM159516
Synonyms:
US9034921, E158 | US9340521, E024
Type:
Small organic molecule
Emp. Form.:
C23H25ClO7
Mol. Mass.:
448.893
SMILES:
OC[C@H]1O[C@H]([C@H](O)[C@@H](O)[C@@H]1O)c1cc(Cc2ccc(cc2)C2CC2)c(Cl)c2OCOc12
: