Target
2-acylglycerol O-acyltransferase 2
Ligand
BDBM159646
Substrate
Meas. Tech.
Inhibition Assay
IC50
42±n/a nM
Citation
 Busujima, TOi, TTanaka, HShirasaki, YIwakiri, KSato, NTokita, S Nitrogen-containing condensed heterocyclic compound US Patent  US9035059 Publication Date 5/19/2015 
Target
Name:
2-acylglycerol O-acyltransferase 2
Synonyms:
2-acylglycerol O-acyltransferase 2 Acyl-CoA:monoacylglycerol acyltransferase 2 (MOGAT2) DGAT2L5 Diacylglycerol acyltransferase 2-like protein 5 MOGAT2 Monoacylglycerol Acyltransferase 2 (MGAT2) hDC5 | hMGAT2
Type:
Enzyme
Mol. Mass.:
38210.80
Organism:
Homo sapiens (Human)
Description:
Q3SYC2
Residue:
334
  
Inhibitor
Name:
BDBM159646
Synonyms:
US9035059, 7-32
Type:
Small organic molecule
Emp. Form.:
C30H40FN3O2S2
Mol. Mass.:
557.786
SMILES:
CCCCCCCc1ccc(NS(=O)(=O)c2ccc3CN(Cc4cnc(s4)C(C)(C)C)CCc3c2)c(F)c1
: