Target
2-acylglycerol O-acyltransferase 2
Ligand
BDBM159681
Substrate
Meas. Tech.
Inhibition Assay
IC50
26±n/a nM
Citation
 Busujima, TOi, TTanaka, HShirasaki, YIwakiri, KSato, NTokita, S Nitrogen-containing condensed heterocyclic compound US Patent  US9035059 Publication Date 5/19/2015 
Target
Name:
2-acylglycerol O-acyltransferase 2
Synonyms:
2-acylglycerol O-acyltransferase 2 Acyl-CoA:monoacylglycerol acyltransferase 2 (MOGAT2) DGAT2L5 Diacylglycerol acyltransferase 2-like protein 5 MOGAT2 Monoacylglycerol Acyltransferase 2 (MGAT2) hDC5 | hMGAT2
Type:
Enzyme
Mol. Mass.:
38210.80
Organism:
Homo sapiens (Human)
Description:
Q3SYC2
Residue:
334
  
Inhibitor
Name:
BDBM159681
Synonyms:
US9035059, 10-3/10-4
Type:
Small organic molecule
Emp. Form.:
C34H45FN2O3S
Mol. Mass.:
580.796
SMILES:
CCCCCCOc1ccc(NS(=O)(=O)c2ccc3CN(CCc3c2)C(C)Cc2ccc(cc2)C(C)(C)C)c(F)c1
: