Target
2-acylglycerol O-acyltransferase 2
Ligand
BDBM159682
Substrate
Meas. Tech.
Inhibition Assay
IC50
25±n/a nM
Citation
 Busujima, TOi, TTanaka, HShirasaki, YIwakiri, KSato, NTokita, S Nitrogen-containing condensed heterocyclic compound US Patent  US9035059 Publication Date 5/19/2015 
Target
Name:
2-acylglycerol O-acyltransferase 2
Synonyms:
2-acylglycerol O-acyltransferase 2 Acyl-CoA:monoacylglycerol acyltransferase 2 (MOGAT2) DGAT2L5 Diacylglycerol acyltransferase 2-like protein 5 MOGAT2 Monoacylglycerol Acyltransferase 2 (MGAT2) hDC5 | hMGAT2
Type:
Enzyme
Mol. Mass.:
38210.80
Organism:
Homo sapiens (Human)
Description:
Q3SYC2
Residue:
334
  
Inhibitor
Name:
BDBM159682
Synonyms:
US9035059, 10-5/10-6
Type:
Small organic molecule
Emp. Form.:
C36H47FN2O2S
Mol. Mass.:
590.834
SMILES:
CC(Cc1ccc(cc1)C(C)(C)C)N1CCc2cc(ccc2C1)S(=O)(=O)Nc1ccc(CCCC2CCCC2)cc1F
: