Target
Tyrosine-protein kinase JAK1
Ligand
BDBM159766
Substrate
Meas. Tech.
Enzyme Assay
pH
7.4±n/a
Temperature
298.15±n/a K
IC50
13±n/a nM
Comments
extracted
Citation
 Brown, MFFenwick, AEFlanagan, MEGonzales, AJohnson, TAKaila, NMitton-Fry, MJStrohbach, JWTenBrink, RETrzupek, JDUnwalla, RJVazquez, MLParikh, MD Pyrrolo[2,3-D]pyrimidine derivatives US Patent  US9035074 Publication Date 5/19/2015 
Target
Name:
Tyrosine-protein kinase JAK1
Synonyms:
JAK-1 JAK1A JAK1_HUMAN Janus kinase 1 (JAK1) | Janus kinase 1 JAK1
Type:
Protein
Mol. Mass.:
133293.73
Organism:
Homo sapiens (Human)
Description:
P23458
Residue:
1154
  
Inhibitor
Name:
BDBM159766
Synonyms:
US10966980, Example 17B | US9035074, 17B
Type:
Small organic molecule
Emp. Form.:
C16H21N7O2S
Mol. Mass.:
375.449
SMILES:
CN([C@@H]1C[C@@H](C1)NS(=O)(=O)N1CC[C@@H](C1)C#N)c1ncnc2[nH]ccc12
: