Target
Tyrosine-protein kinase JAK1
Ligand
BDBM159783
Substrate
Meas. Tech.
Enzyme Assay
pH
7.4±n/a
Temperature
298.15±n/a K
IC50
9±n/a nM
Comments
extracted
Citation
 Brown, MFFenwick, AEFlanagan, MEGonzales, AJohnson, TAKaila, NMitton-Fry, MJStrohbach, JWTenBrink, RETrzupek, JDUnwalla, RJVazquez, MLParikh, MD Pyrrolo[2,3-D]pyrimidine derivatives US Patent  US9035074 Publication Date 5/19/2015 
Target
Name:
Tyrosine-protein kinase JAK1
Synonyms:
JAK-1 JAK1A JAK1_HUMAN Janus kinase 1 (JAK1) | Janus kinase 1 JAK1
Type:
Protein
Mol. Mass.:
133293.73
Organism:
Homo sapiens (Human)
Description:
P23458
Residue:
1154
  
Inhibitor
Name:
BDBM159783
Synonyms:
US10966980, Example 34B | US9035074, 34B
Type:
Small organic molecule
Emp. Form.:
C18H23N5O2S
Mol. Mass.:
373.473
SMILES:
CN([C@@H]1C[C@H](CS(=O)(=O)[C@H]2CC[C@@H](C2)C#N)C1)c1ncnc2[nH]ccc12
: