Target
Serine/threonine-protein kinase receptor R3
Ligand
BDBM160283
Substrate
Meas. Tech.
Flashplate Assay
IC50
1.9±n/a nM
Citation
 Klar, JVöhringer, VTelser, JLobell, MSüβmeier, FLi, VMBöttger, MGolz, SLang, DSchlemmer, KSchlange, TSchall, AFu, W Hydroxymethylaryl-substituted pyrrolotriazines as ALK1 inhibitors US Patent  US9040691 Publication Date 5/26/2015 
Target
Name:
Serine/threonine-protein kinase receptor R3
Synonyms:
ACVL1_HUMAN ACVRLK1 Activin receptor-like kinase 1 (ALK-1) | Serine/threonine-protein kinase receptor R3 (ALK1)
Type:
Enzyme
Mol. Mass.:
56134.46
Organism:
Homo sapiens (Human)
Description:
P37023
Residue:
503
  
Inhibitor
Name:
BDBM160283
Synonyms:
US9040691, 11
Type:
Small organic molecule
Emp. Form.:
C18H19F2N5O
Mol. Mass.:
359.3732
SMILES:
Nc1ncnn2c(cc(-c3cc(F)c(CO)c(F)c3)c12)[C@@H]1CCCNC1
: