Target
Serine/threonine-protein kinase receptor R3
Ligand
BDBM160305
Substrate
Meas. Tech.
Flashplate Assay
IC50
15±n/a nM
Citation
 Klar, JVöhringer, VTelser, JLobell, MSüβmeier, FLi, VMBöttger, MGolz, SLang, DSchlemmer, KSchlange, TSchall, AFu, W Hydroxymethylaryl-substituted pyrrolotriazines as ALK1 inhibitors US Patent  US9040691 Publication Date 5/26/2015 
Target
Name:
Serine/threonine-protein kinase receptor R3
Synonyms:
ACVL1_HUMAN ACVRLK1 Activin receptor-like kinase 1 (ALK-1) | Serine/threonine-protein kinase receptor R3 (ALK1)
Type:
Enzyme
Mol. Mass.:
56134.46
Organism:
Homo sapiens (Human)
Description:
P37023
Residue:
503
  
Inhibitor
Name:
BDBM160305
Synonyms:
US9040691, 33
Type:
Small organic molecule
Emp. Form.:
C19H20F2N4O2
Mol. Mass.:
374.3845
SMILES:
Nc1ncnn2c(cc(-c3cc(F)c(CO)c(F)c3)c12)C1(O)CCCCC1
: