Target
Serine/threonine-protein kinase receptor R3
Ligand
BDBM160310
Substrate
Meas. Tech.
Radiometric Assay
IC50
4±n/a nM
Citation
 Klar, JVöhringer, VTelser, JLobell, MSüβmeier, FLi, VMBöttger, MGolz, SLang, DSchlemmer, KSchlange, TSchall, AFu, W Hydroxymethylaryl-substituted pyrrolotriazines as ALK1 inhibitors US Patent  US9040691 Publication Date 5/26/2015 
Target
Name:
Serine/threonine-protein kinase receptor R3
Synonyms:
ACVL1_HUMAN ACVRLK1 Activin receptor-like kinase 1 (ALK-1) | Serine/threonine-protein kinase receptor R3 (ALK1)
Type:
Enzyme
Mol. Mass.:
56134.46
Organism:
Homo sapiens (Human)
Description:
P37023
Residue:
503
  
Inhibitor
Name:
BDBM160310
Synonyms:
US9040691, 38
Type:
Small organic molecule
Emp. Form.:
C20H24FN5O
Mol. Mass.:
369.4359
SMILES:
CCc1cc(cc(F)c1CO)-c1cc(C2CCCNC2)n2ncnc(N)c12
: