Target
5'-AMP-activated protein kinase subunit beta-1
Ligand
BDBM160333
Substrate
Meas. Tech.
Kinase Assay
IC50
1122±n/a nM
Citation
 Hong, CCHopkins, CRHatzopoulos, AKLindsley, CWHao, J Compounds and methods useful for directing stem cell differentiation US Patent  US9040694 Publication Date 5/26/2015 
Target
Name:
5'-AMP-activated protein kinase subunit beta-1
Synonyms:
5'-AMP-activated protein kinase subunit beta-1 AMP-activated protein kinase alpha-2/beta-1/gamma-3 AMPK subunit beta-1 PRKAB1
Type:
Mol. Mass.:
30380.94
Organism:
Homo sapiens (Human)
Description:
Q9Y478
Residue:
270
  
Inhibitor
Name:
BDBM160333
Synonyms:
US9040694, 5
Type:
Small organic molecule
Emp. Form.:
C22H21N5
Mol. Mass.:
355.4356
SMILES:
C1CN(CCN1)c1ccc(cc1)-c1cnc2c(cnn2c1)-c1ccccc1
: