Target
Serine/threonine-protein kinase/endoribonuclease IRE1
Ligand
BDBM160449
Substrate
Meas. Tech.
Inhibition Assay
pH
7.5±n/a
IC50
<100±n/a nM
Comments
extracted
Citation
 Zeng, QToro, APatterson, JBWade, WSZubovics, ZYang, YWu, Z IRE-1α inhibitors US Patent  US9040714 Publication Date 5/26/2015 
Target
Name:
Serine/threonine-protein kinase/endoribonuclease IRE1
Synonyms:
ERN1 Endoplasmic reticulum-to-nucleus signaling 1 IRE1 Inositol requiring enzyme 1 (IRE-1alpha) Inositol-requiring protein 1 Ire1-alpha Serine/threonine-protein kinase/endoribonuclease IRE1 hIRE1p
Type:
Enzyme
Mol. Mass.:
109731.20
Organism:
Homo sapiens (Human)
Description:
O75460
Residue:
977
  
Inhibitor
Name:
BDBM160449
Synonyms:
US9040714, 171 | US9693992, 171
Type:
Small organic molecule
Emp. Form.:
C18H21NO7
Mol. Mass.:
363.3618
SMILES:
COCCNC(=O)CCc1c(C)c2cc(OC)c(O)c(C=O)c2oc1=O
: