Target
Beta-secretase 2
Ligand
BDBM160676
Substrate
Meas. Tech.
Cell-Free Assay
pH
4.5±n/a
Temperature
310.15±n/a K
IC50
20±n/a nM
Comments
extracted
Citation
 Brodney, MABeck, EMButler, CRDavoren, JEO'Neill, BT Hexahydropyrano[3,4-d][1,3]thiazin-2-amine compounds US Patent  US9045498 Publication Date 6/2/2015 
Target
Name:
Beta-secretase 2
Synonyms:
AEPLC ASP1 Asp 1 Aspartyl protease 1 BACE2_HUMAN Beta-secretase (BACE) Beta-secretase 2 (BACE-2) Beta-site APP-cleaving enzyme 2 Memapsin-1 beta-Secretase (BACE-2)
Type:
Protein
Mol. Mass.:
56171.20
Organism:
Homo sapiens (Human)
Description:
Q9Y5Z0
Residue:
518
  
Inhibitor
Name:
BDBM160676
Synonyms:
US9045498, 18
Type:
Small organic molecule
Emp. Form.:
C22H30FN5O2S
Mol. Mass.:
447.569
SMILES:
COC[C@@H](C)NCc1ccc(F)c(c1)[C@]12CO[C@H](C[C@H]1CSC(N)=N2)c1cnn(C)c1
: