Target
Caspase-10
Ligand
BDBM160841
Substrate
Meas. Tech.
Fluorometric Enzymatic Assay
IC50
>3330±n/a nM
Citation
 Ahlfors, JMekouar, K Selective caspase inhibitors and uses thereof US Patent  US9045524 Publication Date 6/2/2015 
Target
Name:
Caspase-10
Synonyms:
CASP10 MCH4
Type:
Enzyme
Mol. Mass.:
58956.47
Organism:
Homo sapiens (Human)
Description:
Q92851
Residue:
521
  
Inhibitor
Name:
BDBM160841
Synonyms:
US9045524, 111
Type:
Small organic molecule
Emp. Form.:
C36H42N4O11S
Mol. Mass.:
738.804
SMILES:
CC(C)[C@H](NC(=O)[C@H](Cc1cccc2ccccc12)NC(=O)[C@H](CC(O)=O)NC(=O)OCc1ccccc1)C(=O)N[C@@H](CC(O)=O)\C=C\S(C)(=O)=O
: