Target
Tyrosine-protein kinase SYK
Ligand
BDBM161376
Substrate
Meas. Tech.
Enzyme Inhibition Assay
Kd
14±n/a nM
Citation
 Ito, KCharron, CEKing-Underwood, JOnions, STLongshaw, AIBroeckx, RFilliers, WCopmans, A 1-pyrazolyl-3-(4-((2-anilinopyrimidin-4-yl)oxy)napththalen-1-yl) ureas as p38 MAP kinase inhibitors US Patent  US9108950 Publication Date 8/18/2015 
Target
Name:
Tyrosine-protein kinase SYK
Synonyms:
KSYK_HUMAN Spleen Tyrosine Kinase Tyrosine-protein kinase SYK (Syk)
Type:
Enzyme
Mol. Mass.:
72079.99
Organism:
Homo sapiens (Human)
Description:
P43405
Residue:
635
  
Inhibitor
Name:
BDBM161376
Synonyms:
US10238658, Example 1 US9108950, 1 US9993478, Example 1
Type:
Small organic molecule
Emp. Form.:
C35H33N7O2
Mol. Mass.:
583.6822
SMILES:
Cc1ccc(cc1)-n1nc(cc1NC(=O)Nc1ccc(Oc2ccnc(Nc3ccccc3)n2)c2ccccc12)C(C)(C)C
: