Target
Apoptosis regulator Bcl-2
Ligand
BDBM161636
Substrate
Meas. Tech.
Fluorescence Polarisation Assay
pH
7.4±n/a
IC50
1.9±n/a nM
Comments
extracted
Citation
 Le Tiran, ALe Diguarher, TStarck, JHenlin, JGuillouzic, ADe Nanteuil, GGeneste, OFejes, ITatai, JNyerges, MDavidson, JEMurray, JBChen, IDurand, D Pyrrole compounds, a process for their preparation and pharmaceutical compositions containing them US Patent  US9108983 Publication Date 8/18/2015 
Target
Name:
Apoptosis regulator Bcl-2
Synonyms:
Apoptosis regulator Bcl-2 Protein BCL-2 BCL2_HUMAN | Bcl-2 Protein
Type:
Homodimer or heterodimer
Mol. Mass.:
26269.11
Organism:
Homo sapiens (Human)
Description:
P10415
Residue:
239
  
Inhibitor
Name:
BDBM161636
Synonyms:
US9108983, Example 455
Type:
Small organic molecule
Emp. Form.:
C42H43ClN6O4
Mol. Mass.:
731.282
SMILES:
C[C@@H]1Cc2ccccc2CN1C(=O)c1ccc(Cl)cc1-c1cc(C(=O)N(c2cc(C#N)n(CCN3CCOCC3)c2C)c2ccc(O)cc2)c(C)n1C
: