Target
Sodium channel protein type 9 subunit alpha
Ligand
BDBM162285
Substrate
Meas. Tech.
PatchExpress (PX) Assay
IC50
560±n/a nM
Citation
 Dineen, TKreiman, CWeiss, MGeuns-Meyer, S Sulfamide sodium channel inhibitors US Patent  US9051311 Publication Date 6/9/2015 
Target
Name:
Sodium channel protein type 9 subunit alpha
Synonyms:
NENA Peripheral sodium channel 1 SCN9A_HUMAN Voltage-gated sodium channel subunit Nav1.7 hNE-Na
Type:
Protein
Mol. Mass.:
226375.97
Organism:
Homo sapiens (Human)
Description:
Q15858
Residue:
1988
  
Inhibitor
Name:
BDBM162285
Synonyms:
US9051311, 47
Type:
Small organic molecule
Emp. Form.:
C20H19F3N4O3S2
Mol. Mass.:
484.515
SMILES:
COc1cc(ccc1-c1cccc2CN(CC(C)c12)S(=O)(=O)Nc1ncns1)C(F)(F)F
: