Target
Mitogen-activated protein kinase kinase kinase 5
Ligand
BDBM162324
Substrate
Meas. Tech.
Time-Resolved Fluorescence Resonance Energy Transfer (TR-FRET) Assay
IC50
2.5±0.0 nM
Citation
 Notte, G Apoptosis signal-regulating kinase inhibitors US Patent  US9051313 Publication Date 6/9/2015 
Target
Name:
Mitogen-activated protein kinase kinase kinase 5
Synonyms:
ASK1 MAP3K5 MEKK5
Type:
Protein
Mol. Mass.:
154514.93
Organism:
Homo sapiens (Human)
Description:
Q99683
Residue:
1374
  
Inhibitor
Name:
BDBM162324
Synonyms:
US10307427, Compound 15 | US9051313, 15
Type:
Small organic molecule
Emp. Form.:
C26H29N9O2S
Mol. Mass.:
531.633
SMILES:
CC1(O)CCN(CC1)c1cnc(cc1-n1cnc(c1)C1CC1)C(=O)Nc1csc(n1)-c1nncn1C1CC1
: