Target
Mitogen-activated protein kinase kinase kinase 5
Ligand
BDBM162325
Substrate
Meas. Tech.
Time-Resolved Fluorescence Resonance Energy Transfer (TR-FRET) Assay
IC50
2.1±0.0 nM
Citation
 Notte, G Apoptosis signal-regulating kinase inhibitors US Patent  US9051313 Publication Date 6/9/2015 
Target
Name:
Mitogen-activated protein kinase kinase kinase 5
Synonyms:
ASK1 MAP3K5 MEKK5
Type:
Protein
Mol. Mass.:
154514.93
Organism:
Homo sapiens (Human)
Description:
Q99683
Residue:
1374
  
Inhibitor
Name:
BDBM162325
Synonyms:
US10307427, Compound 16 | US9051313, 16
Type:
Small organic molecule
Emp. Form.:
C25H27F3N10OS
Mol. Mass.:
572.608
SMILES:
C[C@H](n1cnnc1-c1nc(NC(=O)c2cc(c(cn2)N2CCN(C)CC2)-n2cnc(c2)C2CC2)cs1)C(F)(F)F
: