Target
Histone deacetylase 6
Ligand
BDBM163627
Substrate
Meas. Tech.
HDAC Activity Assays
IC50
1.08e+4±n/a nM
Citation
 Wang, YStowe, RLPinello, CETian, GMadoux, FLi, DZhao, LYLi, JLWang, YWang, YMa, HHodder, PRoush, WRLiao, D Identification of histone deacetylase inhibitors with benzoylhydrazide scaffold that selectively inhibit class I histone deacetylases. Chem Biol 22:273-84 (2015)  
Target
Name:
Histone deacetylase 6
Synonyms:
Cereblon/Histone deacetylase 6 HDAC6 Histone deacetylase 6 (HDAC6) KIAA0901 | ORF Names:JM21
Type:
Chromatin regulator; hydrolase; repressor
Mol. Mass.:
131381.51
Organism:
Homo sapiens (Human)
Description:
Q9UBN7
Residue:
1215
  
Inhibitor
Name:
BDBM163627
Synonyms:
SR-3459
Type:
Small organic molecule
Emp. Form.:
C12H17N5O
Mol. Mass.:
247.2963
SMILES:
CCCCNNC(=O)c1ccc(C[N-][N+]#N)cc1
: