Target
Histone deacetylase 2/Nuclear receptor corepressor 2 [395-498]
Ligand
BDBM163635
Substrate
Meas. Tech.
HDAC Activity Assays
IC50
3.25e+3±n/a nM
Citation
 Wang, YStowe, RLPinello, CETian, GMadoux, FLi, DZhao, LYLi, JLWang, YWang, YMa, HHodder, PRoush, WRLiao, D Identification of histone deacetylase inhibitors with benzoylhydrazide scaffold that selectively inhibit class I histone deacetylases. Chem Biol 22:273-84 (2015)  
Target
Name:
Histone deacetylase 2/Nuclear receptor corepressor 2 [395-498]
Synonyms:
HDAC2/NCOR2
Type:
Protein
Mol. Mass.:
Description:
BPS Bioscience
Components:
This complex has 2 components.
Component 1
Name:
Histone deacetylase 2
Synonyms:
Cereblon/Histone deacetylase 2 HDAC2 Histone deacetylase 2 (HDAC2) | Human HDAC2
Type:
Chromatin regulator; hydrolase; repressor
Mol. Mass.:
55356.54
Organism:
Homo sapiens (Human)
Description:
Q92769
Residue:
488
  
Component 2
Name:
Nuclear receptor corepressor 2 [395-498]
Synonyms:
CTG26 NCOR2 Nuclear receptor corepressor 2
Type:
Protein
Mol. Mass.:
12719.17
Organism:
Homo sapiens (Human)
Description:
Deacetylase activation domain of human NCOR2 (395-498aa)
Residue:
104
  
Inhibitor
Name:
BDBM163635
Synonyms:
SR-3298 US11731934, Compound RLS2-225
Type:
Small organic molecule
Emp. Form.:
C15H23N3O
Mol. Mass.:
261.3626
SMILES:
CN(C)c1ccc(cc1)C(=O)NNCC1CCCC1
: