Target
Orexin receptor type 2
Ligand
BDBM164086
Substrate
Meas. Tech.
Radioligand Binding Assay
Temperature
313.15±n/a K
Ki
475±n/a nM
Comments
extracted
Citation
 Coate, HRDvorak, CALebold, TPPreville, CShireman, BT Substituted 7-azabicyles and their use as orexin receptor modulators US Patent  US9062078 Publication Date 6/23/2015 
Target
Name:
Orexin receptor type 2
Synonyms:
HCRTR2 OX2R_HUMAN Orexin receptor type 2 (OR-2) Orexin receptor type 2 (OX2R) Ox-2-R | Ox2-R
Type:
Protein
Mol. Mass.:
50710.53
Organism:
Homo sapiens (Human)
Description:
O43614
Residue:
444
  
Inhibitor
Name:
BDBM164086
Synonyms:
US9062078, 216 US9637496, 216 | US9695183, 216
Type:
Small organic molecule
Emp. Form.:
C22H19ClN6O2
Mol. Mass.:
434.878
SMILES:
Clc1ccc2oc(NC3CC4CCC3N4C(=O)c3ccccc3-n3nccn3)nc2c1
: