Target
Amine oxidase [flavin-containing] B
Ligand
BDBM166642
Substrate
Meas. Tech.
MAO Inhibition Assay
IC50
1.2± 0.4 nM
Citation
 Legoabe, LJPetzer, APetzer, JP The Synthesis and Evaluation of C7-Substituted a-Tetralone Derivatives as Inhibitors of Monoamine Oxidase. Chem Biol Drug Des 86:895-904 (2015)  
Target
Name:
Amine oxidase [flavin-containing] B
Synonyms:
AOFB_HUMAN MAOB Monoamine oxidase type B (MAO B) Monoamine oxidase type B (MAOB)
Type:
Protein
Mol. Mass.:
58768.76
Organism:
Homo sapiens (Human)
Description:
P27338
Residue:
520
  
Inhibitor
Name:
BDBM166642
Synonyms:
7-[(4-Cyanobenzyl)oxy]-3,4-dihydronaphthalen-1(2H)-one (4m)
Type:
Small organic molecule
Emp. Form.:
C18H15NO2
Mol. Mass.:
277.3172
SMILES:
O=C1CCCc2ccc(OCc3ccc(cc3)C#N)cc12
: