Target
11-beta-hydroxysteroid dehydrogenase type 2
Ligand
BDBM167446
Substrate
Meas. Tech.
Homogenous Time-Resolved Fluorescence (HTRF) Assay
IC50
>10000±n/a nM
Citation
 Kim, KYAhn, JHKang, SKRhee, SDBae, MAAhn, SHKim, HYJung, WHKang, NS Sulfamide derivative having an adamantyl group and its pharmaceutically acceptable salt US Patent  US9073906 Publication Date 7/7/2015 
Target
Name:
11-beta-hydroxysteroid dehydrogenase type 2
Synonyms:
11-DH2 11-beta-Hydroxysteroid Dehydrogenase 2 (11-beta-HSD2) 11-beta-hydroxysteroid dehydrogenase 2 11-beta-hydroxysteroid dehydrogenase type 2 (11-beta-HSD2) DHI2_HUMAN HSD11K SDR9C3
Type:
Enzyme
Mol. Mass.:
44141.72
Organism:
Homo sapiens (Human)
Description:
Purified recombinant human 11beta-HSD2.
Residue:
405
  
Inhibitor
Name:
BDBM167446
Synonyms:
US9073906, 175
Type:
Small organic molecule
Emp. Form.:
C23H27Cl3N4O4S
Mol. Mass.:
561.909
SMILES:
NC(=O)C12CC3CC(C1)C(NC(=O)CN1CC(=C)CN(c4c(Cl)cc(Cl)cc4Cl)S1(=O)=O)C(C3)C2
: