Target
Aurora kinase B/Inner centromere protein
Ligand
BDBM167513
Substrate
Meas. Tech.
Radioactive Assay
IC50
9±n/a nM
Citation
 Carry, JCheve, MClerc, FCombeau, CGontier, SKrick, ALachaud, SSchio, L Anti-cancer compound and pharmaceutical composition containing the same US Patent  US9073917 Publication Date 7/7/2015 
Target
Name:
Aurora kinase B/Inner centromere protein
Synonyms:
Aurora B/Incenp
Type:
Protein Complex
Mol. Mass.:
Description:
Components:
This complex has 2 components.
Component 1
Name:
Aurora kinase B
Synonyms:
AIK2 AIM1 ARK2 AURKB_HUMAN Aurora B-INCENP Aurora kinase B (AURKB) STK-1 STK12 Serine/threonine-protein kinase aurora B
Type:
Protein
Mol. Mass.:
39327.72
Organism:
Homo sapiens (Human)
Description:
Q96GD4
Residue:
344
  
Component 2
Name:
Inner centromere protein
Synonyms:
INCENP | INCE_HUMAN
Type:
Protein
Mol. Mass.:
105461.33
Organism:
Homo sapiens (Human)
Description:
Q9NQS7
Residue:
918
  
Inhibitor
Name:
BDBM167513
Synonyms:
US9073917, 10- comparative
Type:
Small organic molecule
Emp. Form.:
C25H23N5O2
Mol. Mass.:
425.4824
SMILES:
CC1(C)CC(=O)C2=C(C1)Nc1n[nH]cc1C2c1cccc(Oc2nc3ccccc3[nH]2)c1
: