Target
Fibroblast growth factor 2
Ligand
BDBM167955
Substrate
Meas. Tech.
VEGFR2 Kinase Assay
pH
7.2±n/a
Temperature
298.15±n/a K
IC50
398.11±0.0 nM
Comments
extracted
Citation
 Yin, YSha, SWang, YTWu, XWang, SFQiao, FLv, PCZhu, HL Discovery of new 4-alkoxyquinazoline-based derivatives as potent VEGFR2 inhibitors. Chem Biol Drug Des 86:1323-9 (2015)  
Target
Name:
Fibroblast growth factor 2
Synonyms:
Basic fibroblast growth factor FGF2 FGFB Fibroblast growth factor receptor 2 (FGF-2) Heparin-binding growth factor 2
Type:
Protein
Mol. Mass.:
30803.89
Organism:
Homo sapiens (Human)
Description:
P09038
Residue:
288
  
Inhibitor
Name:
BDBM167955
Synonyms:
1-(4-(2,3-Dichlorophenyl)piperazin-1-yl)-3-(quinazolin-4-yloxy)propan-2-ol (3k)
Type:
Small organic molecule
Emp. Form.:
C21H22Cl2N4O2
Mol. Mass.:
433.331
SMILES:
OC(COc1ncnc2ccccc12)CN1CCN(CC1)c1cccc(Cl)c1Cl
: