Target
Oxysterols receptor LXR-beta
Ligand
BDBM168111
Substrate
Meas. Tech.
Radioligand Binding Assay
Temperature
298.15±n/a K
Ki
21±n/a nM
Comments
extracted
Citation
 Leftheris, KZhuang, L Liver X receptor modulators US Patent  US9073931 Publication Date 7/7/2015 
Target
Name:
Oxysterols receptor LXR-beta
Synonyms:
LXRB Liver X, LXR beta NR1H2 Nuclear receptor NER Ubiquitously-expressed nuclear receptor
Type:
Enzyme Catalytic Domain
Mol. Mass.:
50978.79
Organism:
Homo sapiens (Human)
Description:
P55055
Residue:
460
  
Inhibitor
Name:
BDBM168111
Synonyms:
US9073931, E23a
Type:
Small organic molecule
Emp. Form.:
C22H26F3N5O3S
Mol. Mass.:
497.534
SMILES:
CC(C)[C@H]1N(CCn2c1nc1ccc(cc21)S(C)(=O)=O)c1ncc(c(n1)C(F)(F)F)C(C)(C)O
: