Target
Gag-Pol polyprotein
Ligand
BDBM168609
Substrate
Meas. Tech.
Inhibition Assay
IC50
0.59±n/a nM
Citation
 Boyd, MJMolinaro, CRoy, ATruong, V HIV protease inhibitors US Patent  US9079834 Publication Date 7/14/2015 
Target
Name:
Gag-Pol polyprotein
Synonyms:
HIV-1 reverse transcriptase (HIV-1 RT) POL_HV1H2 Protease Reverse transcriptase (RT) gag-pol p66 RT
Type:
Protein
Mol. Mass.:
162074.74
Organism:
Human immunodeficiency virus type 1 group M subtype B (isolate HXB2)
Description:
P04585
Residue:
1435
  
Inhibitor
Name:
BDBM168609
Synonyms:
US9079834, 4
Type:
Small organic molecule
Emp. Form.:
C35H38F4N4O6S2
Mol. Mass.:
750.823
SMILES:
COC(=O)N[C@@H](C(c1ccccc1)c1ccccc1)C(=O)NCC(F)(F)CC[C@@H](CO)N(CC1CC(F)(F)C1)S(=O)(=O)c1ccc2ncsc2c1
: